{"text_format":"1","workbook":"xlsx","n_sheets":8,"sheets":["1a. READ ME (Start here)","1b. Basic info","2. Scoping","3. Data","4. Examples","5. Calculations","6. Summary","Automation Reference"],"not_rendered":{"charts":1,"images":0,"macros":1,"external_links":0,"defined_names":12,"comments":0,"pivot_tables":0},"unopened":[],"bounds":{"document_bytes":16777216,"sheet_cells":100000,"rows_first":2000,"rows_last":500,"rows_between":2000,"halvings":0,"cell_chars":16384,"cell_head_chars":4096},"cells_cut":0,"cells_raw":0,"read":"whole","date_system":"1900"}

{"sheet":"1a. READ ME (Start here)","index":0,"n_rows":28,"n_cols":3,"rows_kept":28,"cut":false,"hidden":false,"merged":[[3,1,3,6]]}
[]
[null,"Purpose"]
[]
[null,"***Please read through the entirety of this sheet (1a) then proceed to the next sheet (1b).***\n\nThe Greenhouse Gas (GHG) Emission Accounting Template is primarily intended to be used by applicants to satisfy the Critical Mineral Infrastructure Fund (CMIF) program requirements, including demonstrating GHG emission reductions and displacements.\n\nUse of the template ensures a consistent methodology and approach to GHG emission reduction or displacement quantification for all types of projects.\n\nThis template is designed to align with the general specifications of the CSA ISO 14064-2:20 Greenhouse gasses - Part 2 (CSA ISO 14064-2:20), including standardized requirements and processes for project-level GHG quantification, monitoring, and reporting. Please note that use of this template does not ensure that all requirements of CSA ISO 14064-2:20 are met, and may NOT be used to satisfy the requirements of other programs and/or carbon markets.\n\nPlease fill in all REQUIRED fields and pay attention to units. Fields that are not highlighted should NOT be edited."]
[]
[null,"Legend:"]
[]
[null,"REQUIRED Field"]
[null,"OPTIONAL Field"]
[]
[null,"Core tenets:"]
[]
[null,"Completeness","Include all relevant GHG emissions and removals. Include all relevant information to satisfy criteria and procedures."]
[null,"Consistency","Enable meaningful comparisons in GHG-related information."]
[null,"Accuracy","Reduce biases and uncertainties as far as is practical."]
[null,"Transparency","Disclose sufficient and appropriate GHG-related information to allow intended users to make decisions with reasonable confidence."]
[null,"Conservativeness","Use conservative assumptions, values, and procedures to ensure that GHG emission reductions or removal enhancements are not over-estimated."]
[]
[]
[null,"Relevant Definitions"]
[]
[null,"Term","Definition"]
[null,"Greenhouse gas (GHG)","Gaseous constituent of the atmosphere, both natural and anthropogenic, that absorbs and emits radiation at specific wavelengths within the spectrum of infrared radiation emitted by the Earth's surface, the atmosphere, and clouds.\n\nNOTE: GHGs include carbon dioxide (CO2), methane (CH4), nitrous oxide (N2O), hydrofluorocarbons (HFCs), perfluorocarbons (PFCs), and sulfur hexafluoride (SF6), among other gases."]
[null,"GHG emission","Total mass of a GHG (or GHGs) released to the atmosphere over a specified period of time."]
[null,"GHG reduction","Calculated decrease (delta) of GHG emissions between a baseline scenario and the project."]
[null,"GHG displacement","Calculated difference (delta) in GHG emissions between a hypothetical baseline scenario (most-likely alternative) and the project."]
[null,"Baseline scenario","A reference case consisting of events or conditions most likely to persist or occur in the absence of a proposed project. A baseline scenario may also consist of a hypothetical reference case that best represents the conditions most likely to occur in the absence of a proposed project. A baseline scenario determined using a project-specific approach represents what would occur in the absence of the project, whereas a GHG programme can prescribe another approach to determine the baseline scenario, such as a performance standard."]
[null,"Carbon dioxide equivalent (CO2e)","Unit for comparing the radiative forcing of a GHG to that of carbon dioxide.\n\nNOTE: The carbon dioxide equivalent is calculated using the mass of a given GHG multiplied by its global warming potential."]

{"sheet":"1b. Basic info","index":1,"n_rows":65,"n_cols":8,"rows_kept":65,"cut":false,"hidden":false,"merged":[[10,1,10,2],[11,1,11,2],[54,1,54,4],[45,1,45,2],[50,1,50,2],[48,1,48,2],[47,1,47,3],[30,1,30,2],[39,1,39,2],[3,1,3,4],[20,1,20,4],[32,1,32,4],[41,1,41,4],[36,1,36,2],[28,1,28,2],[29,1,29,2],[37,1,37,2],[38,1,38,2],[16,1,16,2],[17,1,17,2],[26,1,26,2],[27,1,27,2],[18,1,18,2],[15,1,15,2],[9,1,9,2],[56,2,56,3],[63,4,63,7],[55,1,55,4],[49,1,49,3],[46,1,46,2]]}
[]
[null,"How this template works"]
[]
[null,"This sheet collects basic information about your energy project for both Stream 1: Preconstruction and Stream 2: Shovel Ready to the Critical Mineral Infrastructure Fund (CMIF). \n\nThis workbook will estimate the annual average GHG reductions and/or displacements of your energy project for the following types/technologies: grid connection (transmission and distribution), renewable energy generation (solar PV and onshore wind), and/or energy storage projects based on the information provided by the applicant. The results will be shown in the Review table at the bottom of this sheet. The results will also be used to prepopulate sheet 6. The methodology for the estimation is also included below. It is the responsibility of the applicant to verify the review table and edit the highlighted cells of sheet 6, as needed.\n\nIf the project includes other technologies (i.e. hydroelectric or biomass generation, etc.), more detailed information is required to estimate the project's GHG displacements and/or reductions. Proceed to and complete sheets 2, 5, and 6. Your answers to the screening questions below will also trigger this result in row 21 and/or in subsequent rows. For further guidance, please send an email to cmif-fimc@nrcan-rncan.gc.ca or consult sheet 4 for examples.\n\nPlease prompts carefully and ensure your inputs are expressed in the correct units for each field."]
[]
[null,"Basic project screening"]
[]
[null,"Project timeline and location"]
[]
[null,"Estimated or known calendar year project is commissioned and achieves actual emission reductions or displacements):"]
[null,"Expected life of funded technology, product, or service (years) (e.g., 10):"]
[null,"Province or territory in which the project is located:"]
[]
[null,"Technologies"]
[]
[null,"Does the project include a new grid connection (transmission or distribution line) to meet loads otherwise met by other energy sources (e.g., diesel, natural gas)?"]
[null,"Does the project include new solar PV panels or onshore wind turbines?"]
[null,"Does the project include new energy storage assets (e.g., battery energy storage system (BESS))?"]
[null,"Does the project include other energy technologies that impact GHG displacements or reductions?"]
[]
[null,{"$f":"IF(OR(D10=\"\",D11=\"\",D12=\"\",D16=\"\",D17=\"\",D18=\"\",D19=\"\"),\"Please complete the fields above. Otherwise, more detailed information about your project's GHG impacts is needed. Please complete sheets 2, 5 and 6.\",IF(AND(D16=\"No\",D17=\"No\",D18=\"No\"),\"Based on the information above, we need more detailed information about your project's GHG impacts. Please proceed to Sheets 2, 5, and 6. Do not complete the fields below.\",IF(D19=\"Yes\",\"Based on the information above, we need more detailed information about your project's GHG impacts. Please complete sheets 2, 5, and 6. Do not complete the fields below.\",\"Please complete the fields below if applicable.\")))","v":"Please complete the fields above. Otherwise, more detailed information about your project's GHG impacts is needed. Please complete sheets 2, 5 and 6."}]
[]
[null,"Energy project information"]
[]
[null,"Grid connection projects"]
[]
[null,"Expected power rating (MW/MVA):"]
[null,"Expected voltage (kV):"]
[null,"Expected distance (km):"]
[null,"Annual energy demand of future and existing mining projects that would be served by the infrastructure (MWh)*:\n\n*Include the sum of all expected or known annual electricity demand of the mining projects that would be served by the infrastructure project."]
{"$rows_left_out":36}
{"sheet":"2. Scoping","index":2,"n_rows":109,"n_cols":7,"rows_kept":109,"cut":false,"hidden":false,"merged":[[42,1,42,6],[94,1,94,6],[29,1,29,6],[33,2,33,5],[34,2,34,5],[35,2,35,5]]}
[]
[null,"Quantification Approach"]
[]
[]
[null,"Index"]
[null,"1. Overview of process"]
[null,"2. Scoping emissions"]
[null,"3. Define the project scenario"]
[null,"4. Identify components of the project that may yield GHG emissions"]
[null,"5. Define the baseline scenario"]
[null,"6. Identify components of the baseline that may yield GHG emissions"]
[]
[]
[null,"Overview of Process"]
[]
[]
[]
[]
[]
[]
[]
[]
[]
[]
[]
[]
[]
[null,"Scoping Emissions"]
[]
[null,"CMIF recognizes that some projects may not be able to quantify direct emission reductions or displacements owing to the nature of their project. As a result, the program offers the following guidance when filling out this template:\n\n1. Generation and energy storage projects must only report Scope 1 emission reductions or displacements to CMIF but applicants are invited to quantify Scope 2 and Scope 3 emissions reductions or displacements as well.\n\n2. Because transmission and distribution infrastructure projects, and projects deploying other technology types often lead to indirect emission reductions or displacements as opposed to direct reductions or displacements, applicants looking to deploy these types of projects are required to quantify Scope 2 and, if applicable, Scope 3 emission reductions or displacements to be considered by the program."]
{"$rows_left_out":80}
{"sheet":"3. Data","index":3,"n_rows":393,"n_cols":28,"rows_kept":393,"cut":false,"hidden":false,"merged":[[293,1,293,2],[303,1,303,2],[309,1,309,2],[375,1,375,2],[224,1,224,5],[231,1,231,2],[241,1,241,2],[257,1,257,2],[267,1,267,2]]}
[]
[null,"Emission Factor Repository"]
[]
[]
[null,"Index"]
[null,"1. Grid Electricity Emission Factors by Province and Territory (without Biomass and RNG CO2 emissions)"]
[null,"2. Technology-specific Life-cycle Emission Factors (NREL)"]
[null,"3. Natural Gas Liquids Combustion Emission Factors"]
[null,"4. Other Combustion Emission Factors"]
[null,"5. Mobile Combustion and Freigth Emission Factors"]
[null,"6. Biomass Emission Factors"]
[null,"7. Common Conversion Factors"]
[null,"7.1 Prefixes and Equivalents"]
[null,"7.2 Distance"]
[null,"7.3 Area"]
[null,"7.4 Volume"]
[null,"7.5 Weight & Mass"]
[null,"7.6 Vehicle Mileage"]
[null,"7.7 Energy Terms"]
[null,"7.8 Liquified Natural Gas (LNG)"]
[]
[]
[null,"Grid Electricity Emission Factors by Province and Territory (without Biomass and RNG CO2 emissions)"]
[]
[null,"- The grid emission intensity corresponds to the ratio of GHG emissions from electricity over the regional sale of electricity. Grid emission intensity = (Combustion emissions from electricity generation by electric utilities + Process emissions from electricity transmission and distribution + (Emissions from electricity generation by industry * Electricity sold by industry to the electric utilities / Electricity generated by industry (own-use and sold to the electric utilities))) / Electricity sold by electric utilities to consumers (including generated by industry)."]
[null,"- These factors correspond to the 'Additional Measures' modelling scenario, which is based on the reference scenario but also accounts for policies and measures that are under development and for which there is enough information for the policies and measures to be modelled. (This scenario was selected as the most conservative estimate)."]
[null,"- Electricity flows between regions are indirectly considered by the calculation method but power generation emissions are attributed to the region where the electricity was generated. Thus, all electricity imports contribute to decrease the electricity grid emission intensities in the importing region since the imported electricity comes without emissions. On the contrary, regions using fossil fuels to generate electricity tend to increase their electricity grid emission intensities when they export electricity since the emissions of exported electricity are allocated to the exporting region."]
[]
[null,"Envrionment and Climate Change Canada Data Catalogue; Electricity Grid Intensities"]
[]
{"$rows_left_out":364}
{"sheet":"4. Examples","index":4,"n_rows":157,"n_cols":39,"rows_kept":157,"cut":false,"hidden":false,"merged":[[34,1,34,4],[34,7,34,10],[31,1,31,10],[31,29,31,38],[34,29,34,32],[34,35,34,38],[31,15,31,24],[34,15,34,18],[34,21,34,24],[67,1,67,10],[70,1,70,4],[70,7,70,10],[67,15,67,24],[70,15,70,18],[70,21,70,24],[103,1,103,10],[106,1,106,4],[106,7,106,10],[103,15,103,24],[106,15,106,18],[106,21,106,24]]}
[]
[null,"Example Calculations"]
[]
[]
[null,"Index"]
[null,"1. Generation Projects"]
[null,"1.1 Example #1: Wind"]
[null,"1.2 Example #2: Solar PV"]
[null,"1.3 Example #3: Solar PV + Energy Storage"]
[null,"2. Energy Storage Projects"]
[null,"2.1 Example #1: Energy Arbitrage in Nova Scotia"]
[null,"2.2 Example #2: Peak Shaving in Ontario"]
[null,"2.3 Example #3: Storage for fast frequency regulation in Alberta"]
[null,"4. Transmisson Projects"]
[null,"4.1 Example #1: Transmission line upgrade at existing facility"]
[]
[]
[]
[]
[]
[]
[]
[]
[]
[null,"Generation Projects",null,null,null,null,null,null,null,null,null,null,null,null,null,"Energy Storage Projects",null,null,null,null,null,null,null,null,null,null,null,null,null,"Transmission Infrastructure Project"]
[]
[]
[]
[null,"Example #1: Alberta wind farm",null,null,null,null,null,null,null,null,null,null,null,null,null,"Example #1: Energy Arbitrage in Nova Scotia",null,null,null,null,null,null,null,null,null,null,null,null,null,"Example #1: Existing facility transmission line upgrade"]
[]
{"$rows_left_out":128}
{"sheet":"5. Calculations","index":5,"n_rows":91,"n_cols":45,"rows_kept":91,"cut":false,"hidden":false,"merged":[[26,1,26,4],[26,7,26,10],[6,2,6,3],[7,2,7,3],[12,1,14,4],[19,1,21,4]]}
[]
[null,"GHG Balance"]
[]
[]
[null,"REFERENCE DOCUMENTS"]
[]
[null,"1. CSA ISO 14064-2:20","Specification with guidance at the project level for quantification, monitoring and reporting of greenhouse gas emission reductions or removal enhancements."]
[null,"2. The GHG Protocol for Project Accounting","The Project Protocol provides specific principles, concepts, and methods for quantifying and reporting GHG reductions from climate change mitigation projects."]
[]
[]
[null,"Instructions:"]
[]
[null,"STEP 1. In the project template, select a component from the dropdown.\n\nSTEP 2. Fill in the table by specifying the parameter, value, unit, and inserting notes, where applicable. Please refer to the examples in the '4. Examples' sheet for guidance on how to fill out the table.\n\n*Please note that if you would like to use 'Variable Electricity Generation Estimates' (recorded in the '2. Scoping' sheet), please proceed to STEP 3.\n\nSTEP 3. Select an emission factor from the '3. Data' sheet and specify its units. Please describe the emission factor in the 'EF Description' field.\n\n*Please note that if you would like to use 'Average Grid Intensity Factors' (recorded in cells C32 - AB44 in the '3. Data' sheet), please click on Button 1. ('1. Use Average Grid Intensity Factors'). Note that the outputs from this calculation will be displayed on the '6. Summary' sheet.\n\n*If you entered 'Variable Electricity Generation Estimates' in the '2. Scoping' sheet and would like to use these values in your calculation, please ensure that you have selected an emission factor and then click on Button 2. ('2. Use Variable Electricity Generation Estimates'). Note that the outputs from this calculation will be displayed on the '6. Summary' sheet.\n\n*If you would like to use 'Average Grid Intensity Factors' AND 'Variable Electricity Generation Estimates', please click on Button 3. ('3. Use Both'). This button will use 'Average Grid Intensity Factors' from the '3. Data' sheet and the values you entered in cells C66 - C91 of the '2. Scoping' sheet to calculate annual emissions [reductions/displacements] for every year of operation. Note that the outputs from this calculation will be displayed on the '6. Summary' sheet.\n\nSTEP 4. Write a formula to calculate annual project-related emissions using the selected emission factor and values recorded in the table. The ouput MUST be in units of tCO2e/year.\n\nSTEP 5. Repeat STEPS 1. - 4. for the baseline in the baseline template.\n\nSTEP 6. Where the project has more than one component, please repeat STEPS 1. - 5. using the template tables."]
[]
[]
[]
[]
[null,"Notes:"]
[]
[null,"- Should you need additional tables, please email the program: cmif-fimc@nrcan-rncan.gc.ca\n\n- Please review the example calculations found in the previous sheet before filling in the tables below."]
[]
[]
[]
[]
[]
[]
[null,"Project",null,null,null,null,null,"Baseline"]
[]
[null,null,null,null,null,null,null,null,null,null,null,null,null,null,null,"Average Grid Intensity Facotrs OR Variable Electricity Generation Estimates",null,null,null,null,null,null,null,null,null,null,null,null,null,null,null,null,null,null,null,null,null,null,null,"Total"]
[null,"Please select component from dropdown below:",null,null,null,null,null,"Please select component from dropdown below:"]
{"$rows_left_out":62}
{"sheet":"6. Summary","index":6,"n_rows":65,"n_cols":9,"rows_kept":65,"cut":false,"hidden":false,"merged":[[16,1,16,2],[17,1,17,2],[6,5,6,7],[6,1,6,3],[33,3,33,4],[23,3,23,4],[24,3,24,4],[25,3,25,4],[26,3,26,4],[27,3,27,4],[34,3,34,4],[35,3,35,4],[36,3,36,4],[37,3,37,4],[28,3,28,4],[29,3,29,4],[30,3,30,4],[31,3,31,4],[32,3,32,4],[38,3,38,4],[39,3,39,4],[40,3,40,4],[41,3,41,4],[42,3,42,4],[50,3,50,4],[51,3,51,4],[52,3,52,4],[43,3,43,4],[44,3,44,4],[45,3,45,4],[46,3,46,4],[47,3,47,4],[63,3,63,4],[64,3,64,4],[3,1,4,8],[20,1,20,8],[58,3,58,4],[59,3,59,4],[60,3,60,4],[61,3,61,4],[62,3,62,4],[53,3,53,4],[54,3,54,4],[55,3,55,4],[56,3,56,4],[57,3,57,4],[48,3,48,4],[49,3,49,4]]}
[]
[null,"Summary"]
[]
[null,"GHG Balance"]
[]
[]
[null,"Direct",null,null,null,"Indirect"]
[]
[null,"Total project emissions (annual):",{"$f":"IF('1b. Basic info'!F63=\"\",'5. Calculations'!C85,'1b. Basic info'!F63)","v":0},"tCO2e/year",null,"Total project emissions (annual):",{"$f":"'5. Calculations'!C88","v":0},"tCO2e/year"]
[null,"Total baseline emissions (annual):",{"$f":"IF('1b. Basic info'!G63=\"\",'5. Calculations'!I85,'1b. Basic info'!G63)","v":0},"tCO2e/year",null,"Total baseline emisisons (annual):",{"$f":"'5. Calculations'!I88","v":0},"tCO2e/year"]
[]
[null,"Net emissions (annual) [DIRECT]:",{"$f":"C10-C9","v":0},"tCO2e/year",null,"Net emissions (annual) [INDIRECT]:",{"$f":"G10-G9","v":0},"tCO2e/year"]
[null,null,{"$f":"IF(OR(SUM('5. Calculations'!AN34:AN59)<>0,SUM('5. Calculations'!AR34:AR59)<>0,SUM('5. Calculations'!AN66:AN91)<>0,SUM('5. Calculations'!AR66:AR91)<>0),\"*Baseline emissions and/or Project emissions vary from year to year. Please consult summary table below.\",\"\")","v":""}]
[null,"Average annual percentage reduction:",{"$f":"(C12+'1b. Basic info'!D3G12)/(C10+G10)","v":{"$error":"#NAME?"}}]
[null,"Quantification of future GHG emission reductions/displacements [DIRECT]"]
[]
[null,"Calendar year project is commissioned and achieves actual emission reductions or displacements:"]
[null,"Life of funded technology, product, or service (years):"]
[]
[null,"Description of variability:"]
[null,"If applicable, please describe any expected change in the anticipated volume of greenhouse gas emission reductions or displacements over time and the reason for this variability."]
[]
[]
[null,"Year","Baseline emissions (tCO2e/year)","Change in baseline emissions (%)",null,"Project emissions (tCO2e/year)","Change in project emissions (%)","Total annual emission reductions/displacements (tCO2e/year)","Cumulative emission reductions/displacements (tCO2e)"]
[null,{"$f":"D17","v":0},{"$f":"IF(B25<>\"\",IF('5. Calculations'!AR66=0,IF('5. Calculations'!AR34=0,C10,'5. Calculations'!AR34),'5. Calculations'!AR66),0)","v":0},0,null,{"$f":"IF(B25<>\"\",IF('5. Calculations'!AN66=0,IF('5. Calculations'!AN34=0,C9,'5. Calculations'!AN34),'5. Calculations'!AN66),0)","v":0},0,{"$f":"C25-F25","v":0},{"$f":"H25","v":0}]
[null,{"$f":"IFERROR(IF((B25+1)>($D$17+$D$18),\"\",(B25+1)),\"\")","v":""},{"$f":"IF(B26<>\"\",IF(B26>2050,(C25+(D26*C25)),IF('5. Calculations'!AR67=0,IF('5. Calculations'!AR35=0,(C25+(D26*C25)),'5. Calculations'!AR35),'5. Calculations'!AR67)),0)","v":0},null,null,{"$f":"IF(B26<>\"\",IF(B26>2050,(F25+(G26*F25)),IF('5. Calculations'!AN67=0,IF('5. Calculations'!AN35=0,(F25+(G26*F25)),'5. Calculations'!AN35),'5. Calculations'!AN67)),0)","v":0},null,{"$f":"C26-F26","v":0},{"$f":"I25+H26","v":0}]
[null,{"$f":"IFERROR(IF((B26+1)>($D$17+$D$18),\"\",(B26+1)),\"\")","v":""},{"$f":"IF(B27<>\"\",IF(B27>2050,(C26+(D27*C26)),IF('5. Calculations'!AR68=0,IF('5. Calculations'!AR36=0,(C26+(D27*C26)),'5. Calculations'!AR36),'5. Calculations'!AR68)),0)","v":0},null,null,{"$f":"IF(B27<>\"\",IF(B27>2050,(F26+(G27*F26)),IF('5. Calculations'!AN68=0,IF('5. Calculations'!AN36=0,(F26+(G27*F26)),'5. Calculations'!AN36),'5. Calculations'!AN68)),0)","v":0},null,{"$f":"C27-F27","v":0},{"$f":"I26+H27","v":0}]
[null,"",{"$f":"IF(B28<>\"\",IF(B28>2050,(C27+(D28*C27)),IF('5. Calculations'!AR69=0,IF('5. Calculations'!AR37=0,(C27+(D28*C27)),'5. Calculations'!AR37),'5. Calculations'!AR69)),0)","v":0},null,null,{"$f":"IF(B28<>\"\",IF(B28>2050,(F27+(G28*F27)),IF('5. Calculations'!AN69=0,IF('5. Calculations'!AN37=0,(F27+(G28*F27)),'5. Calculations'!AN37),'5. Calculations'!AN69)),0)","v":0},null,0,0]
[null,"",{"$f":"IF(B29<>\"\",IF(B29>2050,(C28+(D29*C28)),IF('5. Calculations'!AR70=0,IF('5. Calculations'!AR38=0,(C28+(D29*C28)),'5. Calculations'!AR38),'5. Calculations'!AR70)),0)","v":0},null,null,{"$f":"IF(B29<>\"\",IF(B29>2050,(F28+(G29*F28)),IF('5. Calculations'!AN70=0,IF('5. Calculations'!AN38=0,(F28+(G29*F28)),'5. Calculations'!AN38),'5. Calculations'!AN70)),0)","v":0},null,0,0]
[null,"",{"$f":"IF(B30<>\"\",IF(B30>2050,(C29+(D30*C29)),IF('5. Calculations'!AR71=0,IF('5. Calculations'!AR39=0,(C29+(D30*C29)),'5. Calculations'!AR39),'5. Calculations'!AR71)),0)","v":0},null,null,{"$f":"IF(B30<>\"\",IF(B30>2050,(F29+(G30*F29)),IF('5. Calculations'!AN71=0,IF('5. Calculations'!AN39=0,(F29+(G30*F29)),'5. Calculations'!AN39),'5. Calculations'!AN71)),0)","v":0},null,0,0]
{"$rows_left_out":36}
{"sheet":"Automation Reference","index":7,"n_rows":6,"n_cols":8,"rows_kept":6,"cut":false,"hidden":true,"merged":[]}
[]
[null,"Characterization Dropdown",null,"Type of GHG Reduction",null,"Count of 'Not within project scope' - Project Components",null,"Count of 'Not within project scope' - Baseline Components"]
[null,"Emitting component",null,"Direct",null,{"$f":"COUNTIF(Table5[Characterization '[DROPDOWN']],\"Not within project scope\")","v":0},null,{"$f":"COUNTIF(Table12[Characterization '[Dropdown']],\"Not within project scope\")","v":0}]
[null,"Non-emitting component",null,"Indirect"]
[null,"Not within project scope",null,null,null,"Count of project components",null,"Count of baseline components"]
[null,null,null,null,null,{"$f":"COUNTIF(Table5[Characterization '[DROPDOWN']],\"Emitting component\")+COUNTIF(Table5[Characterization '[DROPDOWN']],\"Non-emitting component\")","v":1},null,{"$f":"COUNTIF(Table12[Characterization '[Dropdown']],\"Emitting component\")+COUNTIF(Table12[Characterization '[Dropdown']],\"Non-emitting component\")","v":0}]