{"text_format":"1","workbook":"xlsx","n_sheets":8,"sheets":["1a. LISEZ-MOI (débutez ici)","1b. Informations de base","2. Détermination de la portée","3. Données","4. Exemples","5. Calculs","6. Résumé","Automation Reference"],"not_rendered":{"charts":1,"images":0,"macros":1,"external_links":0,"defined_names":12,"comments":0,"pivot_tables":0},"unopened":[],"bounds":{"document_bytes":16777216,"sheet_cells":100000,"rows_first":2000,"rows_last":500,"rows_between":2000,"halvings":0,"cell_chars":16384,"cell_head_chars":4096},"cells_cut":0,"cells_raw":0,"read":"whole","date_system":"1900"}

{"sheet":"1a. LISEZ-MOI (débutez ici)","index":0,"n_rows":28,"n_cols":3,"rows_kept":28,"cut":false,"hidden":false,"merged":[[3,1,3,6]]}
[]
[null,"Objet"]
[]
[null,"***Veuillez lire l’intégralité de cette feuille (1a), puis passez à la feuille suivante (1b).***\n\nCette pièce jointe, No I.11 - Estimation des réductions de gaz à effet de serre, est destinée à être utilisée par les demandeurs du volet 1 : Préconstruction et du volet 2 : Prêt à être mis en chantier du Fonds pour l’infrastructure des minéraux critiques (FIMC), et sera utilisée dans le cadre du programme pour l’évaluation de l’impact prévu de l’infrastructure proposée sur les émissions de gaz à effet de serre (GES) provenant des activités d’exploitation des ressources de minéraux critiques.\n\nCe modèle assure l’utilisation d’une méthodologie et d’une approche uniformes pour la quantification de la réduction ou du remplacement des émissions de GES pour tous les types de projets.\n\nCe modèle est aligné sur les spécifications générales de la norme CSA ISO 14064-2:20 Gaz à effet de serre - partie 2 (CSA ISO 14064-2:20), y compris les exigences et les processus normalisés pour la quantification, la surveillance et la déclaration des GES à l’échelle des projets. Veuillez noter que l’utilisation de ce modèle ne garantit pas le respect de toutes les exigences de la norme CSA ISO 14064-2:20 et que ce modèle ne peut PAS être utilisé pour répondre aux exigences d’autres programmes et/ou marchés du carbone.\n\nVeuillez remplir tous les champs en surbrillance et porter attention aux unités. Les champs qui ne sont pas mis en surbrillance ne doivent PAS être modifiés."]
[]
[null,"Légende :"]
[]
[null,"Champ OBLIGATOIRE"]
[null,"Champ FACULTATIF"]
[]
[null,"Principes fondamentaux :"]
[]
[null,"Exhaustivité","Inclure toutes les émissions de GES pertinentes et leurs réductions ou remplacements. Inclure toute information pertinente pour remplir les critères et les procédures."]
[null,"Cohérence","Permettre des comparaisons significatives de l’information relative aux GES."]
[null,"Précision","Réduire les biais et les incertitudes dans la mesure du possible."]
[null,"Transparence","Divulguer de l’information suffisante et appropriée sur les GES pour permettre aux utilisateurs prévus de prendre des décisions en étant raisonnablement confiants."]
[null,"Approche prudente","Adopter des hypothèses, des valeurs et des procédures prudentes pour s’assurer que les réductions des émissions de GES ou les améliorations de l’élimination ne sont pas surestimées."]
[]
[]
[null,"Définitions pertinentes"]
{"$rows_left_out":9}
{"sheet":"1b. Informations de base","index":1,"n_rows":67,"n_cols":8,"rows_kept":67,"cut":false,"hidden":false,"merged":[[10,1,10,2],[11,1,11,2],[45,1,45,2],[50,1,50,2],[48,1,48,2],[47,1,47,3],[30,1,30,2],[39,1,39,2],[3,1,3,4],[20,1,20,4],[32,1,32,4],[41,1,41,4],[36,1,36,2],[28,1,28,2],[29,1,29,2],[37,1,37,2],[38,1,38,2],[16,1,16,2],[17,1,17,2],[26,1,26,2],[27,1,27,2],[18,1,18,2],[15,1,15,2],[9,1,9,2],[29,4,29,7],[53,2,53,3],[65,4,65,7],[52,1,52,4],[49,1,49,3],[46,1,46,2],[56,1,56,4],[57,1,57,4],[58,2,58,3]]}
[]
[null,"Fonctionnement du modèle"]
[]
[null,"Cette feuille permet de recueillir de l’information de base sur votre projet énergétique pour le volet 1 : Préconstruction et le volet 2 : Prêt à être mis en chantier du Fonds pour l’infrastructure des minéraux critiques (FIMC). \n\nCe classeur permettra d’estimer les réductions et/ou les remplacements de GES annuels moyens de votre projet énergétique pour les technologies/types de projet suivants, en fonction de l’information fournie par le demandeur : raccordement au réseau (transport et distribution), production d’énergie renouvelable (solaire PV et éolienne terrestre) et/ou projets de stockage d’énergie. Les résultats figureront dans le tableau de révision présenté au bas de cette feuille. Les résultats seront également utilisés pour remplir la feuille 6. La méthodologie de l’estimation est également présentée ci-dessous. Il incombe au demandeur de vérifier le tableau de révision et de modifier les cellules en surbrillance de la feuille 6, au besoin.\n\nSi le projet inclut d’autres technologies (c’est-à-dire, la production d’hydroélectricité ou de biomasse, etc.), des renseignements plus détaillés sont nécessaires pour estimer les remplacements et/ou les réductions de GES du projet. Veuillez remplir les feuilles 2, 5 et 6. Vos réponses aux questions ci-dessous permettront également d’obtenir ce résultat à la ligne 21.   Pour obtenir plus d’instructions, veuillez envoyer un courriel au cmif-fimc@nrcan-rncan.gc.ca ou consulter la feuille 4 pour des exemples.\n\nVeuillez vous assurer que vos données sont exprimées dans les bonnes unités pour chaque champ."]
[]
[null,"Questions relatives à l’information de base sur le projet"]
[]
[null,"Calendrier et lieu du projet"]
[]
[null,"Année civile prévue ou connue au cours de laquelle le projet est mis en service et réalise dans les faits des réductions ou des remplacements des émissions (p. ex., 2027) :"]
[null,"Durée de vie prévue de la technologie, du produit ou du service financé (années) (p. ex., 10) :"]
[null,"Province ou territoire dans lequel le projet est situé :"]
[]
[null,"Technologies"]
[]
[null,"Un nouveau raccordement au réseau (ligne de transport ou de distribution) est-il prévu dans le cadre du projet pour répondre à des besoins qui seraient autrement satisfaits par d’autres sources d’énergie (p. ex., diesel, gaz naturel)?"]
[null,"Le projet inclut-il de nouveaux actifs de production d’énergie renouvelable (p. ex., panneaux solaires, turbines éoliennes) ?"]
[null,"Le projet inclut-il de nouveaux actifs de stockage d’énergie (p. ex., système de stockage d’énergie par batterie (SSEB)) ?"]
[null,"Le projet inclut-il d’autres technologies énergétiques qui ont un impact sur les remplacements ou les réductions de GES?"]
[]
{"$rows_left_out":48}
{"sheet":"2. Détermination de la portée","index":2,"n_rows":94,"n_cols":7,"rows_kept":94,"cut":false,"hidden":false,"merged":[[27,1,27,6],[79,1,79,6],[14,1,14,6],[18,2,18,5],[19,2,19,5]]}
[]
[null,"Approche de quantification"]
[]
[]
[null,"Table des matières"]
[null,"1. Détermination de la portée des émissions"]
[null,"2. Définition du scénario du projet"]
[null,"3. Identification des composantes du projet susceptibles de générer des émissions de GES"]
[null,"4. Définition du scénario de référence"]
[null,"5. Identification des composantes du scénario de référence susceptibles de générer des émissions de GES"]
[]
[]
[null,"Détermination de la portée des émissions"]
[]
[null,"Le FIMC reconnaît que, pour certains projets, on peut ne pas être en mesure de quantifier les réductions ou les remplacements directs des émissions en raison de la nature du projet. C’est pourquoi les conseils suivants sont donnés pour remplir ce modèle dans le cadre du programme :\n\n1. Pour les projets de production et de stockage d’énergie, les réductions ou les remplacements des émissions de portée 1 seulement doivent être déclarés au CMIF, mais les demandeurs sont également invités à quantifier les réductions ou les remplacements des émissions de portée 2.\n\n2. Étant donné que les projets d’infrastructure de transport et de distribution, ainsi que les projets déployant d’autres types de technologie, entraînent souvent des réductions ou des remplacements indirects des émissions, plutôt que des réductions ou des remplacements directs, les demandeurs souhaitant déployer ces types de projet doivent quantifier les réductions ou les remplacements des émissions de portée 2 pour être pris en compte dans le cadre du programme."]
[]
[null,"Le Protocole des GES classe les réductions et les remplacements des émissions selon leur portée : "]
[]
[null,"Émissions de portée 1\n\n[DIRECT]","Émissions directes de GES produites par des sources qu'une organisation possède ou contrôle. Par exemple, les émissions attribuables à l'exploitation et à l'entretien des éoliennes appartenant au demandeur."]
[null,"Émissions de portée 2\n\n[INDIRECT]","Émissions indirectes de GES liées à l'énergie achetée (électricité, chauffage et climatisation urbains) qui résultent des activités d'une organisation, mais qui se produisent physiquement à des sources détenues ou contrôlées par une autre organisation. Par exemple, les émissions attribuables à la combustion de combustibles fossiles pour chauffer un bâtiment."]
{"$rows_left_out":75}
{"sheet":"3. Données","index":3,"n_rows":393,"n_cols":28,"rows_kept":393,"cut":false,"hidden":false,"merged":[[293,1,293,2],[303,1,303,2],[309,1,309,2],[375,1,375,2],[224,1,224,5],[231,1,231,2],[241,1,241,2],[257,1,257,2],[267,1,267,2]]}
[]
[null,"Référentiel des facteurs d’émissions"]
[]
[]
[null,"Table des matières"]
[null,"1. Facteurs d’émission de l’électricité du réseau par province et territoire (sans les émissions de CO2 de la biomasse et du GNR)"]
[null,"2. Facteurs d’émission du cycle de vie propre à la technologie (NREL)"]
[null,"3. Facteurs d’émission de la combustion des liquides de gaz naturel"]
[null,"4. Autres facteurs d’émission de la combustion"]
[null,"5. Facteurs d’émission de la combustion mobile et du transport de marchandises"]
[null,"6. Facteurs d’émission de la biomasse"]
[null,"7. Facteurs de conversion courants"]
[null,"7.1 Préfixes et équivalents"]
[null,"7.2 Distance"]
[null,"7.3 Superficie"]
[null,"7.4 Volume"]
[null,"7.5 Poids et masse"]
[null,"7.6 Kilométrage/millage d’un véhicule"]
[null,"7.7 Termes liés à l’énergie"]
[null,"7.8 Gaz naturel liquéfié (GNL)"]
{"$rows_left_out":374}
{"sheet":"4. Exemples","index":4,"n_rows":147,"n_cols":39,"rows_kept":147,"cut":false,"hidden":false,"merged":[[28,1,28,4],[28,7,28,10],[25,1,25,10],[25,29,25,38],[28,29,28,32],[28,35,28,38],[25,15,25,24],[28,15,28,18],[28,21,28,24],[61,1,61,10],[64,1,64,4],[64,7,64,10],[61,15,61,24],[64,15,64,18],[64,21,64,24],[97,1,97,10],[100,1,100,4],[100,7,100,10],[97,15,97,24],[100,15,100,18],[100,21,100,24]]}
[]
[null,"Exemples de calcul"]
[]
[]
[null,"Table des matières"]
[null,"1. Projets de production"]
[null,"1.1 Example no 1 : Éolien"]
[null,"1.2 Example no 2 : Solaire PV"]
[null,"1.3 Example no 3 : Solaire PV + Stockage d’énergie"]
[null,"2. Projets de stockage d’énergie"]
[null,"2.1 Example no 1 : Arbitrage énergétique"]
[null,"2.2 Example no 2 : Écrêtement des pointes en Ontario"]
[null,"2.3 Example no 3 : Stockage d'énergie pour la régulation rapide de la fréquence du réseau en Alberta"]
[null,"4. Projets de transport"]
[null,"4.1 Example no 1 : Mise à niveau d'une ligne de transmission d'une installation existante"]
[]
[]
[]
[null,"Projets de production",null,null,null,null,null,null,null,null,null,null,null,null,null,"Projets de stockage d’énergie",null,null,null,null,null,null,null,null,null,null,null,null,null,"Projets d’infrastructure de transport"]
[]
{"$rows_left_out":128}
{"sheet":"5. Calculs","index":5,"n_rows":91,"n_cols":45,"rows_kept":91,"cut":false,"hidden":false,"merged":[[26,1,26,4],[26,7,26,10],[6,2,6,3],[7,2,7,3],[12,1,14,4],[19,1,21,4],[45,2,45,3],[45,8,45,9],[63,2,63,3],[63,8,63,9],[81,2,81,3],[81,8,81,9]]}
[]
[null,"Bilan GES"]
[]
[]
[null,"DOCUMENTS DE RÉFÉRENCE"]
[]
[null,"1. CSA ISO 14064-2:20","Spécifications et lignes directrices, à l’échelle des projets, pour la quantification, la surveillance et la déclaration des réductions d’émissions ou d’amélioration de l’élimination des gaz à effet de serre."]
[null,"2. The GHG Protocol for Project Accounting (Protocole de comptabilisation des GES pour les projets)","Le protocole de comptabilisation des GES pour les projets fournit des principes, des concepts et des méthodes spécifiques pour quantifier et déclarer les réductions de GES résultant de projets d’atténuation des changements climatiques."]
[]
[]
[null,"Lignes directrices :"]
[]
[null,"ÉTAPE 1. Dans le modèle de projet, sélectionner une composante dans la liste déroulante.\n\nÉTAPE 2. Remplir le tableau en précisant le paramètre, la valeur et l’unité, et en insérant des notes, le cas échéant. Veuillez vous reporter aux exemples de la feuille « 4. Exemples » pour savoir comment remplir le tableau.\n\n*Veuillez noter que si vous souhaitez utiliser des « estimations de production d’électricité variable » (enregistrées dans la feuille « 2. Détermination de la portée »), vous devez passer à l’ÉTAPE 3.\n\nÉTAPE 3. Sélectionner un facteur d’émission de la feuille « 3. Données » et préciser ses unités. Veuillez décrire le facteur d’émission dans le champ « Description du FE ».\n\n*Veuillez noter que si vous souhaitez utiliser les « facteurs d’intensité moyens du réseau » (enregistrés dans les cellules C32 - AB44 dans la feuille « 3. Données »), vous devez cliquer sur le bouton 1. (« 1. Utiliser les facteurs d’intensité moyens du réseau »). Il importe de noter que les résultats de ce calcul s’afficheront dans la feuille « 6. Résumé ».\n\n*Si vous avez saisi des « estimations de production d’électricité variable » dans la feuille « 2. Détermination de la portée » et souhaitez utiliser ces valeurs dans vos calculs, assurez-vous d’avoir sélectionné un facteur d’émission et cliquez sur le bouton 2. (« 2. Utiliser des estimations de production d’électricité variable »). Il importe de noter que les résultats de ce calcul s’afficheront dans la feuille « 6. Résumé ».\n\n*Si vous souhaitez utiliser des « facteurs d’intensité moyens du réseau » ET des « estimations de production d’électricité variable », veuillez cliquer sur le bouton 3. (« 3. Utiliser les deux »). Ce bouton permet d’utiliser les « facteurs d’intensité moyens du réseau » de la feuille « 3. Données » et les valeurs que vous avez saisies dans les cellules C66 - C91 de la feuille « 2. « Détermination de la portée » pour calculer les émissions annuelles [réductions/remplacements] pour chaque année d’exploitation. Il importe de noter que les résultats de ce calcul s’afficheront dans la feuille « 6. Résumé ».\n\nÉTAPE 4. Écrire une formule pour calculer les émissions annuelles liées au projet en utilisant le facteur d’émission sélectionné et les valeurs enregistrées dans le tableau. Le résultat DOIT être exprimé en téq CO2/année.\n\nÉTAPE 5. Répéter les ÉTAPES 1. à 4. pour le scénario de référence dans le modèle de référence.\n\nÉTAPE 6. Si le projet comporte plus d’une composante, veuillez répéter les ÉTAPES 1. à 5. à l’aide des tableaux du modèle."]
[]
[]
[]
[]
[null,"Remarques :"]
[]
[null,"- Si vous avez besoin de tableaux supplémentaires, veuillez envoyer un courriel au programme : cmif-fimc@nrcan-rncan.gc.ca.\n\n- Veuillez consulter les exemples de calculs figurant dans la feuille précédente avant de remplir les tableaux ci-dessous."]
{"$rows_left_out":72}
{"sheet":"6. Résumé","index":6,"n_rows":65,"n_cols":9,"rows_kept":65,"cut":false,"hidden":false,"merged":[[16,1,16,2],[17,1,17,2],[6,5,6,7],[6,1,6,3],[33,3,33,4],[23,3,23,4],[24,3,24,4],[25,3,25,4],[26,3,26,4],[27,3,27,4],[34,3,34,4],[35,3,35,4],[36,3,36,4],[37,3,37,4],[28,3,28,4],[29,3,29,4],[30,3,30,4],[31,3,31,4],[32,3,32,4],[38,3,38,4],[39,3,39,4],[40,3,40,4],[41,3,41,4],[42,3,42,4],[50,3,50,4],[51,3,51,4],[52,3,52,4],[43,3,43,4],[44,3,44,4],[45,3,45,4],[46,3,46,4],[47,3,47,4],[63,3,63,4],[64,3,64,4],[3,1,4,8],[20,1,20,8],[58,3,58,4],[59,3,59,4],[60,3,60,4],[61,3,61,4],[62,3,62,4],[53,3,53,4],[54,3,54,4],[55,3,55,4],[56,3,56,4],[57,3,57,4],[48,3,48,4],[49,3,49,4]]}
[]
[null,"Résumé"]
[]
[null,"Bilan GES"]
[]
[]
[null,"Directes",null,null,null,"Indirectes"]
[]
[null,"Total des émissions du projet \n(annuelles) :",{"$f":"IF('1b. Informations de base'!F65=0,'5. Calculs'!C85,'1b. Informations de base'!F65)","v":0},"téq CO2/année",null,"Total des émissions du projet (annuelles) :",{"$f":"'5. Calculs'!C88","v":0},"téq CO2/année"]
[null,"Total des émissions de référence (annuelles) :",{"$f":"IF('1b. Informations de base'!G65=0,'5. Calculs'!I85,'1b. Informations de base'!G65)","v":0},"téq CO2/année",null,"Total des émissions de référence (annuelles) :",{"$f":"'5. Calculs'!I88","v":0},"téq CO2/année"]
[]
[null,"Émissions nettes (annuelles) \n[DIRECTES] :",{"$f":"C10-C9","v":0},"téq CO2/année",null,"Émissions nettes (annuelles) [INDIRECTES] :",{"$f":"G10-G9","v":0},"téq CO2/année"]
[null,null,{"$f":"IF(OR(SUM('5. Calculs'!AN34:AN59)<>0,SUM('5. Calculs'!AR34:AR59)<>0,SUM('5. Calculs'!AN66:AN91)<>0,SUM('5. Calculs'!AR66:AR91)<>0),\"*Baseline emissions and/or Project emissions vary from year to year. Please consult summary table below.\",\"\")","v":""}]
[null,"Pourcentage annuel moyen de réduction :",{"$f":"(C12+G12)/(C10+G10)","v":{"$error":"#DIV/0!"}}]
[null,"Quantification des réductions/remplacements futurs des émissions de GES [DIRECTES]"]
[]
[null,"Année civile au cours de laquelle le projet est mis en service et réalise dans les faits des réductions ou des remplacements d’émissions :"]
[null,"Durée de vie de la technologie, du produit ou du service financé (années) :"]
[]
[null,"Description de la variabilité :"]
{"$rows_left_out":46}
{"sheet":"Automation Reference","index":7,"n_rows":6,"n_cols":8,"rows_kept":6,"cut":false,"hidden":true,"merged":[]}
[]
[null,"Characterization Dropdown",null,"Type of GHG Reduction",null,"Count of 'Not within project scope' - Project Components",null,"Count of 'Not within project scope' - Baseline Components"]
[null,"Composante émettrice",null,"Directes",null,{"$f":"COUNTIF(Table5[Caractérisation '[Liste déroulante']],\"Not within project scope\")","v":0},null,{"$f":"COUNTIF(Table12[Caractérisation '[Liste déroulante']],\"Not within project scope\")","v":0}]
[null,"Composante non émettrice",null,"Indirectes"]
[null,"Ne relève pas de la portée du projet",null,null,null,"Count of project components",null,"Count of baseline components"]
[null,null,null,null,null,{"$f":"COUNTIF(Table5[Caractérisation '[Liste déroulante']],\"Emitting component\")+COUNTIF(Table5[Caractérisation '[Liste déroulante']],\"Non-emitting component\")","v":0},null,{"$f":"COUNTIF(Table12[Caractérisation '[Liste déroulante']],\"Emitting component\")+COUNTIF(Table12[Caractérisation '[Liste déroulante']],\"Non-emitting component\")","v":0}]